{"text_format":"3","workbook":"xlsx","n_sheets":7,"sheets":["汇总","财政局部门预算文本","Sheet7","Sheet2","Sheet3","粘贴","本级"],"not_rendered":{"defined_names":2},"read":"whole","date_system":"1900"}

{"sheet":"汇总","index":0,"n_rows":211,"n_cols":12,"rows_kept":211,"merged":[[0,0,0,1],[1,0,1,11],[2,0,2,3],[2,9,2,11],[3,0,4,0],[3,1,4,1],[3,2,4,2],[3,3,3,5],[3,6,3,7],[3,8,4,8],[3,9,4,9],[3,10,4,10],[3,11,4,11]]}
["附件6"]
["部门绩效自评结果公开汇总表"]
["主管部门：石家庄市城市管理综合行政执法局",{"$nulls":8},"单位：万元"]
["序号","项目名称","项目实施单位","预算数（调整后）",null,null,"执行数（至2024年底）",null,"结余数","结余交回财政数","自评得分","自评结果应用意见"]
[{"$nulls":3},"中央","省级","市级","市级","县（市）区级"]
[1,"既有燃气管道用户加装安全装置经费","石家庄市城市管理综合行政执法局系统",null,null,1000,null,1000,null,0,100,"完成较好"]
[2,"环卫工人协助管理非机动车停放秩序奖补资金","石家庄市城市管理综合行政执法局系统",null,null,499,0,0,499,0,0,"2024年7月，通过上半年绩效监控发现裕华区、新华区、长安区、桥西区普遍存在环卫工人清扫压力大，清扫保洁工作任务繁重，无法同时进行非机动车停放秩序维护工作，为不影响环卫工人清扫保洁本职工作，故终止该项目实施。"]
[3,"中央大气污染防治资金","石家庄市城市管理综合行政执法局系统",1548,{"$nulls":3},842.46,705.54,0,95.4,"完成较好"]
[4,"2023年市区支路整修工程","石家庄市城市管理综合行政执法局系统",null,null,314,null,314,null,0,100,"完成较好"]
[5,"2023-2024年采暖季农村“双代”市级运行补助","石家庄市城市管理综合行政执法局系统",null,null,463.8,null,463.8,null,0,100,"完成较好"]
[6,"仓丰东路雨水泵站新建工程国债项目","石家庄市城市管理综合行政执法局本级",4705,235.25,177.75,3993.37,null,1124.63,177.01,97.8,"完成较好"]
[7,"东南退水明渠建设国债项目","石家庄市城市管理综合行政执法局本级",134709,3367.72,40035.37,109813.31,null,68298.78,397.559999999998,80.57,"完成较好"]
[8,"明珠街、石铜路、槐中路雨水调蓄设施新建工程国债项目","石家庄市城市管理综合行政执法局本级",10443,522.15,2088.85,7411.09,null,5642.91,2087.32,95.68,"完成较好"]
[9,"石家庄市移动排涝能力提升项目国债项目","石家庄市城市管理综合行政执法局本级",28756,1437.8,5752.2,34829.79,null,1116.21,1116.21,100,"完成较好"]
[10,"雨水调蓄设施建设工程国债项目","石家庄市城市管理综合行政执法局本级",30652,1532.6,6131.4,24562.02,0,13753.98,6126.88,96.41,"完成较好"]
[11,"市区积水点整治工程国债项目","石家庄市城市管理综合行政执法局本级",3478,173.9,696.1,3178.45,0,1169.55,695.52,97.31,"完成较好"]
[12,"四支渠（新华路-南泄洪渠）新建工程国债项目","石家庄市城市管理综合行政执法局本级",47548,1188.7,1263.3,28347.67,0,21652.33,1256.3,85.87,"完成较好"]
[13,"农机街泵站新建工程国债项目","石家庄市城市管理综合行政执法局本级",7142,357.1,1429,6472.97,0,2455.13,1428.98,97.25,"完成较好"]
[14,"污水污泥处理经费","石家庄市城市管理综合行政执法局本级",null,null,39200.5,39198.83,0,1.66999999999825,1.66999999999825,100,"完成较好"]
[15,"农机街泵站新建工程国债项目征地费用市级补助","石家庄市城市管理综合行政执法局本级",null,null,2667,2667,0,0,0,100,"完成较好"]
[16,"仓丰东路雨水泵站新建工程国债项目征地费用市级补助","石家庄市城市管理综合行政执法局本级",null,null,1432,1002,0,430,430,97,"完成较好"]
[17,"2024年城市更新行动城市建设项目","石家庄市城市管理综合行政执法局本级",null,null,20000,0,0,null,0,0,"部分使用中央财政资金的项目正在加紧推进前期手续办理，项目资料暂未齐全，暂不具备中央财政资金拨付条件。本着资金拨付审批程序和手续完整、规范的原则，部分中央财政资金暂未执行。根据目前城市更新行动推进计划，将进一步推动项目各项工作进展，按照各级资金管理办法及财务要求，在项目满足资金拨付条件后，尽快完成资金拨付工作。"]
[18,"液化气居民用户安装物联报警器 和自动切断装置项目","石家庄市城市管理综合行政执法局本级",1917,null,null,12.78,null,1904.22,0,69,"由于安装进度滞后，预算执行率较低。下一步整改措施：加强宣传动员，优化安装流程，确保按期完成安装任务，提高预算执行率。"]
[19,"2023年城管局机关城建项目资金","石家庄市城市管理综合行政执法局本级",null,null,151.85,151.85,0,0,0,100,"完成较好"]
[20,"DLP高清拼接屏采购项目尾款","石家庄市城市管理综合行政执法局本级",null,null,94.77,94.77,0,0,0,100,"完成较好"]
[21,"安全生产监督工作经费","石家庄市城市管理综合行政执法局本级",null,null,15,15,0,0,0,100,"完成较好"]
[22,"城区防汛汛期应急指挥车租赁经费","石家庄市城市管理综合行政执法局本级",null,null,10.2,10.2,0,0,0,100,"完成较好"]
[23,"城市运营中心场地租用费","石家庄市城市管理综合行政执法局本级",null,null,61,61,0,0,0,100,"完成较好"]
[24,"党组织活动经费","石家庄市城市管理综合行政执法局本级",null,null,9.17,9.17,0,0,0,100,"完成较好"]
[25,"电梯运维费","石家庄市城市管理综合行政执法局本级",null,null,1.4,1.4,0,0,0,100,"完成较好"]
{"$rows_left_out":182}
{"sheet":"财政局部门预算文本","index":1,"n_rows":233,"n_cols":18,"rows_kept":233,"hidden":true,"merged":[[0,0,1,0],[0,1,1,1],[0,2,1,2],[0,3,0,5],[0,6,0,7],[0,8,1,8],[0,9,1,9],[0,10,1,10],[0,11,1,11],[2,0,2,1],[3,0,3,11],[4,0,4,3],[4,9,4,11],[5,0,6,0],[5,1,6,1],[5,2,6,2],[5,3,5,5],[5,6,5,7],[5,8,6,8],[5,9,6,9],[5,10,6,10],[5,11,6,11]]}
["序号","项目名称","项目实施单位","预算数（调整后）",null,null,"执行数（至2024年底）",null,"结余数","结余交回财政数","自评得分","自评结果应用意见",{"$nulls":3},"结转"]
[{"$nulls":3},"中央","省级","市级","市级","县（市）区级"]
["附件6"]
["部门绩效自评结果公开汇总表"]
["主管部门：石家庄市城市管理综合行政执法局",{"$nulls":8},"单位：万元",null,null,"已报送","未报送","重点自评"]
["序号","项目名称","项目实施单位","预算数（调整后）",null,null,"执行数（至2024年底）",null,"结余数","结余交回财政数","自评得分","自评结果应用意见",{"$nulls":3},"结转"]
[{"$nulls":3},"中央","省级","市级","市级","县（市）区级"]
[1,"既有燃气管道用户加装安全装置经费","石家庄市城市管理综合行政执法局系统",null,null,1000,null,1000,{"$f":"D8+E8+F8-G8-H8","v":0},{"$f":"I8","v":0},100,null,"燃热科",null,"重点自评",0]
[2,"环卫工人协助管理非机动车停放秩序奖补资金","石家庄市城市管理综合行政执法局系统",null,null,2960,null,499,2461,2461,70,null,"市容科",null,"重点自评",0]
[3,"中央大气污染防治资金","石家庄市城市管理综合行政执法局系统",6082.3,{"$nulls":3},6082.3,0,0,100,null,"双代办",null,"重点自评",0]
[4,"仓丰东路雨水泵站新建工程国债项目","石家庄市城市管理综合行政执法局本级",4705,235.25,177.75,3993.37,null,{"$f":"D11+E11+F11-G11","v":1124.63},1124.63,97.8,null,"市政科",null,"重点自评",830,{"$f":"I11-P11","v":294.63}]
[5,"东南退水明渠建设国债项目","石家庄市城市管理综合行政执法局本级",134709,3367.72,40035.37,109813.31,null,68298.78,68298.78,80.57,null,"市政科",null,"重点自评",67901.22,{"$f":"I12-P12","v":397.559999999998}]
[6,"明珠街、石铜路、槐中路雨水调蓄设施新建工程国债项目","石家庄市城市管理综合行政执法局本级",10443,522.15,2088.85,7411.09,null,5642.91,5642.91,95.68,null,"市政科",null,"重点自评",3555.59,2087.32]
[7,"石家庄市移动排涝能力提升项目国债项目","石家庄市城市管理综合行政执法局本级",28756,1437.8,5752.2,34829.79,null,1116.21,1116.21,100,null,"市政科",null,"重点自评",{"$f":"VLOOKUP(B14,粘贴!B:L,11,0)","v":{"$error":"#N/A"}},{"$error":"#N/A"}]
[8,"雨水调蓄设施建设工程国债项目","石家庄市城市管理综合行政执法局本级",30652,1532.6,6131.4,24562.02,null,13753.98,13753.98,96.41,null,"市政科",null,"重点自评",7627.1,6126.88]
[9,"市区积水点整治工程国债项目","石家庄市城市管理综合行政执法局本级",3478,173.9,696.1,3178.45,null,1169.55,1169.55,97.31,null,"市政科",null,"重点自评",474.03,695.52]
[10,"四支渠（新华路-南泄洪渠）新建工程国债项目","石家庄市城市管理综合行政执法局本级",47548,1188.7,1263.3,28347.67,null,21652.33,21652.33,85.87,null,"市政科",null,"重点自评",{"$f":"VLOOKUP(B17,粘贴!B:L,11,0)","v":0},21652.33]
[11,"农机街泵站新建工程国债项目","石家庄市城市管理综合行政执法局本级",7142,357.1,1429,6472.97,null,2455.13,2455.13,97.25,null,"市政科",null,"重点自评",1026.15,1428.98]
[12,"排水管网改造项目经费（桥西区四项工程）","石家庄市城市管理综合行政执法局本级",null,null,2166.38,null,null,{"$f":"D19+E19+F19-G19-H19","v":2166.38},2166.38,0,"完成一般","防汛办",null,"重点自评",{"$f":"VLOOKUP(B19,粘贴!B:L,11,0)","v":{"$error":"#N/A"}},{"$error":"#N/A"}]
[13,"排水管网改造项目经费（新华区五项工程）","石家庄市城市管理综合行政执法局本级",null,null,1021.31,null,null,1021.31,1021.31,0,"完成一般","防汛办",null,"重点自评",{"$f":"VLOOKUP(B20,粘贴!B:L,11,0)","v":{"$error":"#N/A"}},{"$error":"#N/A"}]
[14,"育才街(和平路-方北路、裕华路-民心河)雨污水提升改造工程经费","石家庄市城市管理综合行政执法局本级",null,null,1952.3,null,null,1952.3,1952.3,0,"完成一般","防汛办",null,"重点自评",{"$f":"VLOOKUP(B21,粘贴!B:L,11,0)","v":{"$error":"#N/A"}},{"$error":"#N/A"}]
[15,"市区支路增设雨水管道工程经费","石家庄市城市管理综合行政执法局本级",null,null,4493.34,null,null,4493.34,4493.34,0,"完成一般","防汛办",null,"重点自评",{"$f":"VLOOKUP(B22,粘贴!B:L,11,0)","v":{"$error":"#N/A"}},{"$error":"#N/A"}]
[16,"泰华街雨污水干管新建工程经费","石家庄市城市管理综合行政执法局本级",null,null,2175.5,null,null,2175.5,2175.5,0,"完成一般","防汛办",null,"重点自评",{"$f":"VLOOKUP(B23,粘贴!B:L,11,0)","v":{"$error":"#N/A"}},{"$error":"#N/A"}]
[17,"污水污泥处理经费","石家庄市城市管理综合行政执法局本级",null,null,39200.5,39198.83,null,{"$f":"D24+E24+F24-G24","v":1.66999999999825},1.66999999999825,100,null,"供水科",null,"重点自评",{"$f":"VLOOKUP(B24,粘贴!B:L,11,0)","v":0},1.66999999999825]
[18,"农机街泵站新建工程国债项目征地费用市级补助","石家庄市城市管理综合行政执法局本级",null,null,2667,2667,null,0,0,100,null,"市政科",null,null,{"$f":"VLOOKUP(B25,粘贴!B:L,11,0)","v":{"$error":"#N/A"}},{"$error":"#N/A"}]
[19,"仓丰东路雨水泵站新建工程国债项目征地费用市级补助","石家庄市城市管理综合行政执法局本级",null,null,1432,1002,null,430,430,97,null,"市政科",null,null,{"$f":"VLOOKUP(B26,粘贴!B:L,11,0)","v":{"$error":"#N/A"}},{"$error":"#N/A"}]
[20,"2024年城市更新行动城市建设项目","石家庄市城市管理综合行政执法局本级",null,null,20000,null,null,{"$f":"D27+E27+F27-G27-H27","v":20000},20000,68,"完成一般",{"$nulls":3},{"$f":"VLOOKUP(B27,粘贴!B:L,11,0)","v":{"$error":"#N/A"}},{"$error":"#N/A"}]
[21,"液化气居民用户安装物联报警器 和自动切断装置项目","石家庄市城市管理综合行政执法局本级",1917,null,null,12.78,null,{"$f":"D28+E28+F28-G28","v":1904.22},{"$f":"I28","v":1904.22},69,null,"燃热科",null,null,{"$f":"VLOOKUP(B28,粘贴!B:L,11,0)","v":1904.22},0]
[22,"2023年城管局机关城建项目资金","石家庄市城市管理综合行政执法局本级",null,null,151.85,151.85,null,0,0,100,null,"景观科",null,null,1096.8,-1096.8]
[23,"DLP高清拼接屏采购项目尾款","石家庄市城市管理综合行政执法局本级",null,null,94.77,94.77,null,0,0,100,null,"市容科",null,null,{"$f":"VLOOKUP(B30,粘贴!B:L,11,0)","v":{"$error":"#N/A"}},{"$error":"#N/A"}]
{"$rows_left_out":204}
{"sheet":"Sheet7","index":2,"n_rows":324,"n_cols":10,"rows_kept":324,"hidden":true}
["预算单位","预算数","调整预算数","本级支出","支出进度%","支出功能分类","政府支出经济分类","项目名称","项目类别","资金性质"]
["[565001]石家庄市城市管理综合行政执法局本级",52.9,52.9,40.8365,77.2,"[2120104]城管执法","[50299]其他商品和服务支出","市景观办工作经费","[3]特定目标类","[111]一般公共预算资金"]
["[565001]石家庄市城市管理综合行政执法局本级",0.000106,0,0,0,"[2120104]城管执法","[50306]设备购置","办公设备购置","[22]其他运转类","[111]一般公共预算资金"]
["[565001]石家庄市城市管理综合行政执法局本级",81.999894,81.999894,65.6196,80.02,"[2120104]城管执法","[50306]设备购置","办公设备购置","[22]其他运转类","[111]一般公共预算资金"]
["[565001]石家庄市城市管理综合行政执法局本级",11,11,10.9926,99.93,"[2120104]城管执法","[50201]办公经费","文件资料印刷费","[22]其他运转类","[111]一般公共预算资金"]
["[565001]石家庄市城市管理综合行政执法局本级",9.17,9.17,9.16832,99.98,"[2120104]城管执法","[50299]其他商品和服务支出","党组织活动经费","[22]其他运转类","[111]一般公共预算资金"]
["[565001]石家庄市城市管理综合行政执法局本级",138.68,138.68,62.306,44.93,"[2120104]城管执法","[50205]委托业务费","业务咨询委托费","[22]其他运转类","[111]一般公共预算资金"]
["[565001]石家庄市城市管理综合行政执法局本级",30,30,29.9845,99.95,"[2120104]城管执法","[50209]维修（护）费","专用设备维修费","[22]其他运转类","[111]一般公共预算资金"]
["[565001]石家庄市城市管理综合行政执法局本级",40,40,37.3612,93.4,"[2120104]城管执法","[50203]培训费","业务培训费","[22]其他运转类","[111]一般公共预算资金"]
["[565001]石家庄市城市管理综合行政执法局本级",1.4,1.4,1.4,100,"[2120104]城管执法","[50209]维修（护）费","电梯运维费","[22]其他运转类","[111]一般公共预算资金"]
["[565001]石家庄市城市管理综合行政执法局本级",5.71,5.70539,5.70539,100,"[2120104]城管执法","[50205]委托业务费","执法制式服装费尾款\t\t\t","[3]特定目标类","[111]一般公共预算资金"]
["[565001]石家庄市城市管理综合行政执法局本级",61,61,61,100,"[2120104]城管执法","[50201]办公经费","城市运营中心场地租用费","[3]特定目标类","[111]一般公共预算资金"]
["[565001]石家庄市城市管理综合行政执法局本级",345,345,345,100,"[2121402]代征手续费","[50201]办公经费","污水处理费代征手续费","[3]特定目标类","[121]政府性基金预算资金"]
["[565001]石家庄市城市管理综合行政执法局本级",10,10,10,100,"[2120199]其他城乡社区管理事务支出","[50205]委托业务费","供水水质监测经费","[3]特定目标类","[111]一般公共预算资金"]
["[565001]石家庄市城市管理综合行政执法局本级",300,300,0,0,"[2121302]城市环境卫生","[50205]委托业务费","公益广告设置经费","[3]特定目标类","[121]政府性基金预算资金"]
["[565001]石家庄市城市管理综合行政执法局本级",50.87,50.87,0,0,"[2120104]城管执法","[50205]委托业务费","城市管理运行经费","[3]特定目标类","[111]一般公共预算资金"]
["[565001]石家庄市城市管理综合行政执法局本级",30,30,14.5,48.33,"[2120104]城管执法","[50205]委托业务费","户外广告拍卖方案编制经费","[3]特定目标类","[111]一般公共预算资金"]
["[565001]石家庄市城市管理综合行政执法局本级",45,43.81117,10.382545,23.7,"[2120104]城管执法","[50201]办公经费","环卫工人意外伤害救助金","[3]特定目标类","[111]一般公共预算资金"]
["[565001]石家庄市城市管理综合行政执法局本级",30,30,17.82,59.4,"[2120104]城管执法","[50205]委托业务费","特许经营项目咨询服务经费","[3]特定目标类","[111]一般公共预算资金"]
["[565001]石家庄市城市管理综合行政执法局本级",15,15,15,100,"[2120104]城管执法","[50205]委托业务费","安全生产监督工作经费","[3]特定目标类","[111]一般公共预算资金"]
["[565001]石家庄市城市管理综合行政执法局本级",80,80,38.253,47.82,"[2120104]城管执法","[50307]大型修缮","建设南大街35号院前楼修缮项目资金","[3]特定目标类","[111]一般公共预算资金"]
["[565001]石家庄市城市管理综合行政执法局本级",20,20,20,100,"[2121302]城市环境卫生","[50205]委托业务费","生活垃圾分类运行资金","[3]特定目标类","[121]政府性基金预算资金"]
["[565001]石家庄市城市管理综合行政执法局本级",27,25.55025,25.55025,100,"[2120102]一般行政管理事务","[50205]委托业务费","物业管理费","[3]特定目标类","[111]一般公共预算资金"]
["[565001]石家庄市城市管理综合行政执法局本级",10.3,10.2,10.2,100,"[2120104]城管执法","[50201]办公经费","城区防汛汛期应急指挥车租赁经费","[3]特定目标类","[111]一般公共预算资金"]
["[565001]石家庄市城市管理综合行政执法局本级",450,450,183.5172,40.78,"[2121302]城市环境卫生","[50205]委托业务费","垃圾监测整治经费","[3]特定目标类","[121]政府性基金预算资金"]
["[565001]石家庄市城市管理综合行政执法局本级",39.43,39.43,38.5668,97.81,"[2120104]城管执法","[50205]委托业务费","城管全民动员大会及宣传活动经费","[3]特定目标类","[111]一般公共预算资金"]
["[565001]石家庄市城市管理综合行政执法局本级",30,30,28.358,94.53,"[2120104]城管执法","[50205]委托业务费","双代办第三方评估监督经费","[3]特定目标类","[111]一般公共预算资金"]
["[565001]石家庄市城市管理综合行政执法局本级",94.77,94.77,94.77,100,"[2120104]城管执法","[50306]设备购置","DLP高清拼接屏采购项目尾款\t","[3]特定目标类","[111]一般公共预算资金"]
["[565001]石家庄市城市管理综合行政执法局本级",90,85.0984,85.0984,100,"[2120104]城管执法","[50205]委托业务费","国家节水型城市复查迎检工作经费","[3]特定目标类","[111]一般公共预算资金"]
["[565001]石家庄市城市管理综合行政执法局本级",34.02,34.02,16.19246,47.6,"[2120104]城管执法","[50201]办公经费","海绵城市方案编制及海绵办工作经费","[3]特定目标类","[111]一般公共预算资金"]
{"$rows_left_out":295}
{"sheet":"Sheet2","index":3,"n_rows":235,"n_cols":15,"rows_kept":235,"hidden":true,"merged":[[0,0,0,1],[1,0,1,11],[3,0,3,3],[3,9,3,11],[4,0,5,0],[4,1,5,1],[4,2,5,2],[4,3,4,5],[4,6,4,7],[4,8,5,8],[4,9,5,9],[4,10,5,10],[4,11,5,11]]}
["附件6"]
["部门绩效自评结果公开汇总表"]
[]
["主管部门：石家庄市城市管理综合行政执法局",{"$nulls":8},"单位：万元",null,null,"已报送","未报送","重点自评"]
["序号","项目名称","项目实施单位","预算数（调整后）",null,null,"执行数（至2024年底）",null,"结余数","结余交回财政数","自评得分","自评结果应用意见"]
[{"$nulls":3},"中央","省级","市级","市级","县（市）区级"]
[1,"既有燃气管道用户加装安全装置经费","石家庄市城市管理综合行政执法局系统",null,null,1000,null,1000,{"$f":"D7+E7+F7-G7-H7","v":0},{"$f":"I7","v":0},null,null,"燃热科",null,"重点自评"]
[2,"环卫工人协助管理非机动车停放秩序奖补资金","石家庄市城市管理综合行政执法局系统",null,null,2960,null,499,2461,2461,null,null,"市容科",null,"重点自评"]
[3,"中央大气污染防治资金","石家庄市城市管理综合行政执法局系统",6082.3,{"$nulls":3},6082.3,0,0,null,null,"双代办",null,"重点自评"]
[4,"仓丰东路雨水泵站新建工程国债项目","石家庄市城市管理综合行政执法局本级",4705,235.25,177.75,3993.37,null,{"$f":"D10+E10+F10-G10","v":1124.63},1124.63,null,null,"市政科",null,"重点自评"]
[5,"东南退水明渠建设国债项目","石家庄市城市管理综合行政执法局本级",134709,3367.72,40035.37,109813.31,null,68298.78,68298.78,null,null,"市政科",null,"重点自评"]
[6,"明珠街、石铜路、槐中路雨水调蓄设施新建工程国债项目","石家庄市城市管理综合行政执法局本级",10443,522.15,2088.85,7411.09,null,5642.91,5642.91,null,null,"市政科",null,"重点自评"]
[7,"石家庄市移动排涝能力提升项目国债项目","石家庄市城市管理综合行政执法局本级",28756,1437.8,5752.2,34829.8,null,1116.2,1116.2,null,null,"市政科",null,"重点自评"]
[8,"雨水调蓄设施建设工程国债项目","石家庄市城市管理综合行政执法局本级",30652,1532.6,6131.4,24562.02,null,13753.98,13753.98,null,null,"市政科",null,"重点自评"]
[9,"市区积水点整治工程国债项目","石家庄市城市管理综合行政执法局本级",3478,173.9,696.1,3178.45,null,1169.55,1169.55,null,null,"市政科",null,"重点自评"]
[10,"四支渠（新华路-南泄洪渠）新建工程国债项目","石家庄市城市管理综合行政执法局本级",47548,1188.7,1263.3,28347.67,null,21652.33,21652.33,null,null,"市政科",null,"重点自评"]
[11,"农机街泵站新建工程国债项目","石家庄市城市管理综合行政执法局本级",7142,357.1,1429,6472.97,null,2455.13,2455.13,null,null,"市政科",null,"重点自评"]
[14,"排水管网改造项目经费（桥西区四项工程）","石家庄市城市管理综合行政执法局本级",null,null,2166.38,null,null,2166.38,2166.38,null,null,"防汛办",null,"重点自评"]
[15,"排水管网改造项目经费（新华区五项工程）","石家庄市城市管理综合行政执法局本级",null,null,1021.31,null,null,1021.31,1021.31,null,null,"防汛办",null,"重点自评"]
[16,"育才街(和平路-方北路、裕华路-民心河)雨污水提升改造工程经费","石家庄市城市管理综合行政执法局本级",null,null,1952.3,null,null,1952.3,1952.3,null,null,"防汛办",null,"重点自评"]
[17,"市区支路增设雨水管道工程经费","石家庄市城市管理综合行政执法局本级",null,null,4493.34,null,null,4493.34,4493.34,null,null,"防汛办",null,"重点自评"]
[18,"泰华街雨污水干管新建工程经费","石家庄市城市管理综合行政执法局本级",null,null,2175.5,null,null,2175.5,2175.5,null,null,"防汛办",null,"重点自评"]
[30,"污水污泥处理经费","石家庄市城市管理综合行政执法局本级",null,null,39200.5,39198.83,null,1.66999999999825,1.66999999999825,null,null,"供水科",null,"重点自评"]
[null,null,"石家庄市城市管理综合行政执法局本级"]
[12,"农机街泵站新建工程国债项目征地费用市级补助","石家庄市城市管理综合行政执法局本级",null,null,2667,2667,null,{"$f":"D25+E25+F25-G25","v":0},{"$f":"I25","v":0},null,null,"市政科"]
[13,"仓丰东路雨水泵站新建工程国债项目征地费用市级补助","石家庄市城市管理综合行政执法局本级",null,null,1432,1002,null,430,430,null,null,"市政科"]
[null,"2024年城市更新行动城市建设项目","石家庄市城市管理综合行政执法局本级",null,null,20000]
[31,"液化气居民用户安装物联报警器 和自动切断装置项目","石家庄市城市管理综合行政执法局本级",1917,null,null,12.78,null,1904.22,1904.22,null,null,"燃热科"]
[32,"2023年城管局机关城建项目资金","石家庄市城市管理综合行政执法局本级",null,null,151.85,151.85,null,0,0,null,null,"景观科"]
[33,"DLP高清拼接屏采购项目尾款\t","石家庄市城市管理综合行政执法局本级",null,null,94.77,94.77,null,0,0,null,null,"市容科"]
{"$rows_left_out":206}
{"sheet":"Sheet3","index":4,"n_rows":235,"n_cols":18,"rows_kept":235,"hidden":true,"merged":[[0,0,1,0],[0,1,1,1],[0,2,1,2],[0,3,0,5],[0,6,0,7],[0,8,1,8],[0,9,1,9],[0,10,1,10],[0,11,1,11],[2,0,2,1],[3,0,3,11],[5,0,5,3],[5,9,5,11],[6,0,7,0],[6,1,7,1],[6,2,7,2],[6,3,6,5],[6,6,6,7],[6,8,7,8],[6,9,7,9],[6,10,7,10],[6,11,7,11]]}
["序号","项目名称","项目实施单位","预算数（调整后）",null,null,"执行数（至2024年底）",null,"结余数","结余交回财政数","自评得分","自评结果应用意见"]
[{"$nulls":3},"中央","省级","市级","市级","县（市）区级",{"$nulls":4},"已报送","未报送","重点自评"]
["附件6"]
["部门绩效自评结果公开汇总表"]
[]
["主管部门：石家庄市城市管理综合行政执法局",{"$nulls":8},"单位：万元",null,null,"已报送","未报送","重点自评"]
["序号","项目名称","项目实施单位","预算数（调整后）",null,null,"执行数（至2024年底）",null,"结余数","结余交回财政数","自评得分","自评结果应用意见"]
[{"$nulls":3},"中央","省级","市级","市级","县（市）区级"]
[1,"既有燃气管道用户加装安全装置经费","石家庄市城市管理综合行政执法局系统",null,null,1000,null,1000,{"$f":"D9+E9+F9-G9-H9","v":0},{"$f":"I9","v":0},100,null,"燃热科",null,"重点自评"]
[2,"环卫工人协助管理非机动车停放秩序奖补资金","石家庄市城市管理综合行政执法局系统",null,null,2960,null,499,2461,2461,92,null,"市容科",null,"重点自评"]
[3,"中央大气污染防治资金","石家庄市城市管理综合行政执法局系统",6082.3,{"$nulls":3},6082.3,0,0,100,null,"双代办",null,"重点自评"]
[4,"仓丰东路雨水泵站新建工程国债项目","石家庄市城市管理综合行政执法局本级",4705,235.25,177.75,3993.37,null,{"$f":"D12+E12+F12-G12","v":1124.63},1124.63,97.8,null,"市政科",null,"重点自评",{"$f":"D12+E12+F12","v":5118}]
[5,"东南退水明渠建设国债项目","石家庄市城市管理综合行政执法局本级",134709,3367.72,40035.37,109813.31,null,68298.78,68298.78,80.57,null,"市政科",null,"重点自评"]
[6,"明珠街、石铜路、槐中路雨水调蓄设施新建工程国债项目","石家庄市城市管理综合行政执法局本级",10443,522.15,2088.85,7411.09,null,5642.91,5642.91,95.68,null,"市政科",null,"重点自评"]
[7,"石家庄市移动排涝能力提升项目国债项目","石家庄市城市管理综合行政执法局本级",28756,1437.8,5752.2,34829.8,null,1116.2,1116.2,100,null,"市政科",null,"重点自评"]
[8,"雨水调蓄设施建设工程国债项目","石家庄市城市管理综合行政执法局本级",30652,1532.6,6131.4,24562.02,null,13753.98,13753.98,96.41,null,"市政科",null,"重点自评"]
[9,"市区积水点整治工程国债项目","石家庄市城市管理综合行政执法局本级",3478,173.9,696.1,3178.45,null,1169.55,1169.55,97.31,null,"市政科",null,"重点自评"]
[10,"四支渠（新华路-南泄洪渠）新建工程国债项目","石家庄市城市管理综合行政执法局本级",47548,1188.7,1263.3,28347.67,null,21652.33,21652.33,85.87,null,"市政科",null,"重点自评"]
[11,"农机街泵站新建工程国债项目","石家庄市城市管理综合行政执法局本级",7142,357.1,1429,6472.97,null,2455.13,2455.13,97.25,null,"市政科",null,"重点自评"]
[12,"排水管网改造项目经费（桥西区四项工程）","石家庄市城市管理综合行政执法局本级",null,null,2166.38,null,null,2166.38,2166.38,80,null,"防汛办",null,"重点自评"]
[13,"排水管网改造项目经费（新华区五项工程）","石家庄市城市管理综合行政执法局本级",null,null,1021.31,null,null,1021.31,1021.31,80,null,"防汛办",null,"重点自评"]
[14,"育才街(和平路-方北路、裕华路-民心河)雨污水提升改造工程经费","石家庄市城市管理综合行政执法局本级",null,null,1952.3,null,null,1952.3,1952.3,80,null,"防汛办",null,"重点自评"]
[15,"市区支路增设雨水管道工程经费","石家庄市城市管理综合行政执法局本级",null,null,4493.34,null,null,4493.34,4493.34,80,null,"防汛办",null,"重点自评"]
[16,"泰华街雨污水干管新建工程经费","石家庄市城市管理综合行政执法局本级",null,null,2175.5,null,null,2175.5,2175.5,80,null,"防汛办",null,"重点自评"]
[17,"污水污泥处理经费","石家庄市城市管理综合行政执法局本级",null,null,39200.5,39198.83,null,1.66999999999825,1.66999999999825,100,null,"供水科",null,"重点自评"]
[18,"农机街泵站新建工程国债项目征地费用市级补助","石家庄市城市管理综合行政执法局本级",null,null,2667,2667,null,0,0,100,null,"市政科"]
[19,"仓丰东路雨水泵站新建工程国债项目征地费用市级补助","石家庄市城市管理综合行政执法局本级",null,null,1432,1002,null,430,430,97,null,"市政科"]
[20,"2024年城市更新行动城市建设项目","石家庄市城市管理综合行政执法局本级",null,null,20000,{"$nulls":4},78]
[21,"液化气居民用户安装物联报警器 和自动切断装置项目","石家庄市城市管理综合行政执法局本级",1917,null,null,12.78,null,{"$f":"D29+E29+F29-G29","v":1904.22},{"$f":"I29","v":1904.22},82,null,"燃热科"]
[22,"2023年城管局机关城建项目资金","石家庄市城市管理综合行政执法局本级",null,null,151.85,151.85,null,0,0,95.4,null,"景观科"]
{"$rows_left_out":206}
{"sheet":"粘贴","index":5,"n_rows":278,"n_cols":12,"rows_kept":278,"hidden":true,"merged":[[0,5,0,11]]}
["项目名称",null,"项目承担单位",null,"功能分类科目编码","资金来源"]
[{"$nulls":5},"合 计","一般公共预算拨款","基金预算拨款","国有资本经营预算拨款","财政专户核拨","单位资金","上年结转结余"]
["合计",{"$nulls":4},474206.79,81511.8,260102.18,null,null,2389.79,130203.02]
["特定目标类项目小计",{"$nulls":4},473025.47,80338.49,260102.18,null,null,2381.78,130203.02]
[1,"安全生产监督工作经费","石家庄市城市管理综合行政执法局本级",null,2120104,12,12]
[2,"保安服务费用","石家庄火车站站前地区管理委员会",null,2120104,1296,1296]
[3,"北二环路慢行系统改造","石家庄市道桥设施管护中心",null,2120803,113.14,{"$nulls":5},113.14]
[4,"城管全民动员大会及宣传活动经费","石家庄市城市管理综合行政执法局本级",null,2120104,17.83,17.83]
[5,"城管热线运行维护费","石家庄市城市管理便民服务中心",null,2120104,32,32]
[6,"城区防汛监控系统运行费","石家庄市排水管护中心",null,2120399,100.4,100.4]
[7,"城区防汛汛期应急指挥车租赁经费","石家庄市城市管理综合行政执法局本级",null,2120104,10.3,10.3]
[8,"城市地下市政基础设施普查工作经费","石家庄市城市管理综合行政执法局本级",null,2121301,600,null,600]
[9,"城市排水（雨水）防涝综合规划编制费","石家庄市排水管护中心",null,2121399,157,null,157]
[10,"代收生活垃圾处理费手续费","石家庄市环境卫生事务中心",null,2120501,490,490]
[11,"道桥设施管护中心办公区域综合整治","石家庄市道桥设施管护中心",null,2120399,7,{"$nulls":4},7]
[12,"地道桥雨水泵站规划编制费","石家庄市排水管护中心",null,2121399,129,null,129]
[13,"冬季融雪及移动公厕运行经费","石家庄市市容环卫服务中心　",null,2120501,57,57]
[14,"防汛经费","石家庄市城市管理综合行政执法局本级",null,2120104,30,30]
[15,"废旧电池处置运行费","石家庄市危险废弃物处置场",null,2121302,59,null,59]
[16,"给水、污水再生利用工程两项规划编制经费","石家庄市城市管理综合行政执法局本级",null,2121399,250,null,250]
[17,"供热补贴经费","石家庄市供热事务中心",null,2120803,14000,null,14000]
[18,"供热智慧管理平台扩容项目质保金","石家庄市供热事务中心",null,2120399,8.28,8.28]
[19,"供水水质监测经费","石家庄市城市管理综合行政执法局本级",null,2120104,10,10]
[20,"公益广告设置经费","石家庄市城市管理综合行政执法局本级",null,2121302,298,null,298]
[21,"广场管护费","石家庄火车站站前地区管理委员会",null,2120501,423.62,423.62]
[22,"广场管护经费","石家庄火车站站前地区管理委员会",null,2121302,781.75,null,781.75]
[23,"国家节水型城市复查迎检工作经费","石家庄市城市管理综合行政执法局本级",null,2120104,15.1,15.1]
[24,"环境卫生绩效考核奖励资金","石家庄市环境卫生事务中心",null,2120501,1200,1200]
[25,"环境卫生事务专项业务经费","石家庄市环境卫生事务中心",null,2120501,88.4,88.4]
[26,"环卫工人意外伤害救助金经费","石家庄市城市管理综合行政执法局本级",null,2120104,45,45]
{"$rows_left_out":249}
{"sheet":"本级","index":6,"n_rows":91,"n_cols":9,"rows_kept":91,"hidden":true,"merged":[[1,0,1,5],[1,6,1,8],[2,0,4,0],[2,1,4,1],[2,2,2,8],[3,2,4,2],[3,3,4,3],[3,5,4,5],[3,6,4,6],[3,7,4,7],[21,0,22,0]]}
[]
["565001石家庄市城市管理综合行政执法局本级",{"$nulls":5},"单位：万元"]
["项目名称","功能分类科目编码","资 金 来 源"]
[null,null,"合 计","一般公共        预算拨款","基金预算","国有资本经营预算拨款","财政专户核拨","单位资金","上年结转"]
[{"$nulls":4},"拨款",{"$nulls":3},"结余"]
["合计",null,314150.71,24005.76,181361.55,{"$nulls":3},108783.41]
["公务用车购置经费",2120104,18,18]
["安全生产监督工作经费",2120104,12,12]
["仓丰东路雨水泵站新建工程国债项目市级配套资金",2120803,1054,null,1054]
["仓丰东路雨水泵站新建工程省级补助第二批",2120399,117.62,{"$nulls":5},117.62]
["仓丰东路雨水泵站新建工程省级补助资金",2120399,117.63,{"$nulls":5},117.63]
["仓丰东路雨水泵站新建工程中央补助资金",2120399,712.37,{"$nulls":5},712.37]
["拆迁工地扬尘监测服务资金",2120104,95.95,95.95]
["长安区市政燃气地下管网更新改造项目中央补助资金",2110302,243.47,{"$nulls":5},243.47]
["城管局机关2023年及以前年度城建项目资金",2120803,1096.8,{"$nulls":5},1096.8]
["城管全民动员大会及宣传活动经费",2120104,17.83,17.83]
["城区防汛汛期应急指挥车租赁经费",2120104,10.3,10.3]
["城市地下市政基础设施普查工作经费",2121301,600,null,600]
["城市更新行动全过程技术咨询及资金绩效管理全过程咨询服务工作经费",2120104,600,600]
["城市供水老旧管网修复及漏损治理项目（桥西区）中央补助资金",2110302,330,{"$nulls":5},330]
["东南退水明渠建设国债项目市级配套资金",2120803,29260.79,null,29260.79]
["东南退水明渠建设省级补助资金",2120399,3367.73,3367.73]
[null,2120399,3367.72,{"$nulls":5},3367.72]
["东南退水明渠建设中央补助资金",2120399,64533.5,{"$nulls":5},64533.5]
["防汛经费",2120104,30,30]
["高新区市政中压老旧管网改造更新工程项目中央补助资金",2110302,74.8,{"$nulls":5},74.8]
["给水、污水再生利用工程两项规划编制经费尾款",2121399,250,null,250]
["供水水质监测经费",2120104,10,10]
["公益广告设置经费",2121302,298,null,298]
["国家节水型城市复查迎检工作经费尾款",2120104,15.1,15.1]
{"$rows_left_out":61}